BDBM356725 1-(3-(3,6-difluoro- 9H-carbazol-9-yl)-2- hydroxypropyl)-6- methylpiperidin-2- one::US10214507, Compound 39::US10759777, Compound 39
SMILES CC1CCCC(=O)N1CC(O)Cn1c2ccc(F)cc2c2cc(F)ccc12
InChI Key InChIKey=YBCNLHCGDVOMHJ-UHFFFAOYSA-N
Data  3 EC50
  Tab Delimited (TSV)   2D SDfile   Computed 3D by Vconf -m prep SDfile
Find this compound or compounds like it in BindingDB:
Activity Spreadsheet -- Enzyme Inhibition Constant Data from BindingDB
Found 3 hits for monomerid = 356725
TargetPeriod circadian protein homolog 2(Homo sapiens (Human))
Reset Therapeutics
US Patent
LigandPNGBDBM356725(1-(3-(3,6-difluoro- 9H-carbazol-9-yl)-2- hydroxypr...)
Affinity DataEC50:  342nM. Assay description: Compounds were screened by using a high-throughput circadian assay system as previously described in Zhang, E. E. et al. Cell, 2009, 139, 199-210. In...
Ligand InfoPC cidPC sid
In DepthDetails US Patent
TargetPeriod circadian protein homolog 2(Homo sapiens (Human))
Reset Therapeutics
US Patent
LigandPNGBDBM356725(1-(3-(3,6-difluoro- 9H-carbazol-9-yl)-2- hydroxypr...)
Affinity DataEC50:  342nM. Assay description: In brief, stable U20S reporter cells harboring Per2-dLuc were plated at a density of 30,000 cells/well in Corning 96-well, solid white, flat bottom, ...
Ligand InfoPC cidPC sid
In DepthDetails US Patent
TargetCryptochrome-2(Homo sapiens)TBA
LigandPNGBDBM356725(1-(3-(3,6-difluoro- 9H-carbazol-9-yl)-2- hydroxypr...)
Affinity DataEC50:  541nM. Assay description: Modulation activity at CRY2/PER2 in human U2OS cells harboring per2-dLuc assessed as activation of per2 activity measured every 100 mins for 5 days b...
Ligand InfoPC cidPC sid
In DepthDetails ArticlePubMed