BDBM3572 8-[(3-Bromophenyl)amino]-1-methyl-1H-imidazo[4,5-g]-quinazoline::Imidazoquinazoline deriv. 10::N-(3-bromophenyl)-1-methyl-1H-imidazo[4,5-g]quinazolin-8-amine
SMILES Cn1cnc2cc3ncnc(Nc4cccc(Br)c4)c3cc12
InChI Key InChIKey=LQIKOEJHMCCOSP-UHFFFAOYSA-N
Data  1 IC50
  Tab Delimited (TSV)   2D SDfile   Computed 3D by Vconf -m prep SDfile
Find this compound or compounds like it in BindingDB:
Activity Spreadsheet -- Enzyme Inhibition Constant Data from BindingDB
Found 1 hit for monomerid = 3572
TargetEpidermal growth factor receptor(Homo sapiens (Human))
University of Auckland
LigandPNGBDBM3572(8-[(3-Bromophenyl)amino]-1-methyl-1H-imidazo[4,5-g...)
Affinity DataIC50:  0.0100nMpH: 7.4 T: 2°C. Assay description: IC50 is the inhibitor concentration which inhibits 50% of kinase activity that catalyzes the transfer of the terminal phosphate from [gamma-32P] labe...
In DepthDetails ArticlePubMed