BDBM357676 US10214527, Example 48
SMILES Nc1cc(Cc2cccc(c2)-c2ccn(Cc3ccccc3)n2)c2nn[nH]c2n1
InChI Key InChIKey=PCMISLYDURSAHY-UHFFFAOYSA-N
Data  2 IC50
  Tab Delimited (TSV)   2D SDfile   Computed 3D by Vconf -m prep SDfile
Find this compound or compounds like it in BindingDB:
Activity Spreadsheet -- Enzyme Inhibition Constant Data from BindingDB
Found 2 hits for monomerid = 357676
TargetMyeloperoxidase(Homo sapiens (Human))
Bristol-Myers Squibb
US Patent
LigandPNGBDBM357676(US10214527, Example 48)
Affinity DataIC50:  55nM. Assay description: MPO peroxidation activity was measured in 100 mM KPi (pH 7.4) by utilizing the non-fluorescent reagent Amplex Red (Invitrogen catalog # A12222) which...
Ligand InfoPC cidPC sid
In DepthDetails US Patent
TargetMyeloperoxidase(Homo sapiens (Human))
Bristol-Myers Squibb
US Patent
LigandPNGBDBM357676(US10214527, Example 48)
Affinity DataIC50:  500nM. Assay description: MPO chlorination activity was measured in 100 mM KPi (pH 7.4) by utilizing the non-fluorescent reagent Aminophenyl fluorescein (APF, Invitrogen catal...
Ligand InfoPC cidPC sid
In DepthDetails US Patent