BDBM358982 (4aS,7R)-7-[8-amino-1- (4-{(1R)-1-hydroxy-1-[3- (trifluoromethyl)phenyl] ethyl}phenyl)imidazo [1,5-a]pyrazin-3-yl]-2- methyloctahydro-1H- pyrido[1,2-c]pyrimidin- 1-one::US10214546, Example 114
SMILES CN1CC[C@@H]2CC[C@H](CN2C1=O)c1nc(-c2ccc(cc2)[C@@](C)(O)c2cccc(c2)C(F)(F)F)c2c(N)nccn12
InChI Key InChIKey=JDVRZSJLDVHIEO-KBXCTZIRSA-N
Data  1 IC50
  Tab Delimited (TSV)   2D SDfile   Computed 3D by Vconf -m prep SDfile
Find this compound or compounds like it in BindingDB:
Activity Spreadsheet -- Enzyme Inhibition Constant Data from BindingDB
Found 1 hit for monomerid = 358982
TargetTyrosine-protein kinase BTK(Homo sapiens (Human))
Merck Sharp & Dohme
US Patent
LigandPNGBDBM358982((4aS,7R)-7-[8-amino-1- (4-{(1R)-1-hydroxy-1-[3- (t...)
Affinity DataIC50:  0.220nM. Assay description: BTK enzymatic activity was determined with the LANCE (Lanthanide Chelate Excite) TR-FRET (Time-resolved fluorescence resonance energy transfer) assay...
Ligand InfoPC cidPC sid
In DepthDetails US Patent