BDBM359821 (S)-(2-(2-(methoxyamino)-2-oxoethyl)-4-((3-(trifluoromethyl)phenyl)sulfonyl)-3,4-dihydro-2H-benzo[b][1,4]oxazin-6-yl)carbamic acid (44)::US10221146, Example 44
SMILES CONC(=O)C[C@H]1CN(c2cc(NC(=O)OC(C)(C)C)ccc2O1)S(=O)(=O)c1cccc(c1)C(F)(F)F
InChI Key InChIKey=JCAUPCPSFTUKRH-INIZCTEOSA-N
Data  1 IC50
  Tab Delimited (TSV)   2D SDfile   Computed 3D by Vconf -m prep SDfile
Find this compound or compounds like it in BindingDB:
Activity Spreadsheet -- Enzyme Inhibition Constant Data from BindingDB
Found 1 hit for monomerid = 359821
TargetNuclear receptor ROR-gamma(Homo sapiens (Human))
Lycera
US Patent
LigandPNGBDBM359821((S)-(2-(2-(methoxyamino)-2-oxoethyl)-4-((3-(triflu...)
Affinity DataIC50:  4.07nM. Assay description: HIS-tagged RORγ-LBD protein was recombinantly expressed in Escherichia coli. The RORγ-LBD protein was purified by Ni2+-affinity resin. Puri...
Ligand InfoPC cidPC sid
In DepthDetails US Patent