BDBM361553 (S)-3-((1R,3R)-1-(5-fluoro-2-(2-((3-fluoropropyl)(methyl)amino)ethoxy)-3-methylpyridin-4-yl)-3-methyl-1,3,4,9-tetrahydro-2H-pyrido[3,4-b]indol-2-yl)-2-methylpropanoic acid::US10221173, Example 145::US10590132, Example 145::US11046689, Example 145
SMILES C[C@@H](CN1[C@H](C)Cc2c([nH]c3ccccc23)[C@H]1c1c(F)cnc(OCCN(C)CCCF)c1C)C(O)=O
InChI Key
Data  9 IC50
  Tab Delimited (TSV)   2D SDfile   Computed 3D by Vconf -m prep SDfile
Find this compound or compounds like it in BindingDB:
Activity Spreadsheet -- Enzyme Inhibition Constant Data from BindingDB
Found 9 hits for monomerid = 361553
TargetEstrogen receptor(Homo sapiens (Human))
Astrazeneca
US Patent
LigandPNGBDBM361553((S)-3-((1R,3R)-1-(5-fluoro-2-(2-((3-fluoropropyl)(...)
Affinity DataIC50:  1.10nM. Assay description: The ability of compounds to bind to isolated Estrogen Receptor Alpha Ligand binding domain (ER alpha—LBD (GST)) was assessed in competition assays us...
Ligand InfoPC cidPC sid
In DepthDetails US Patent
TargetEstrogen receptor(Homo sapiens (Human))
Astrazeneca
US Patent
LigandPNGBDBM361553((S)-3-((1R,3R)-1-(5-fluoro-2-(2-((3-fluoropropyl)(...)
Affinity DataIC50:  0.350nM. Assay description: The ability of compounds to down-regulate Estrogen Receptor (ER) numbers was assessed in a cell based immuno-fluorescence assay using the MCF-7 human...
Ligand InfoPC cidPC sid
In DepthDetails US Patent
TargetPotassium voltage-gated channel subfamily H member 2(Homo sapiens (Human))
Astrazeneca
US Patent
LigandPNGBDBM361553((S)-3-((1R,3R)-1-(5-fluoro-2-(2-((3-fluoropropyl)(...)
Affinity DataIC50: >4.00E+4nM. Assay description: hERG (human ether a go go-related gene) potassium channels are essential for normal electrical activity in the heart. Arrhythmia can be induced by a ...
Ligand InfoPC cidPC sid
In DepthDetails US Patent
TargetEstrogen receptor [307-554](Homo sapiens (Human))
Astrazeneca
US Patent
LigandPNGBDBM361553((S)-3-((1R,3R)-1-(5-fluoro-2-(2-((3-fluoropropyl)(...)
Affinity DataIC50:  1.10nM. Assay description: ERα: The ability of compounds to bind to isolated Estrogen Receptor Alpha Ligand binding domain (ER alpha-LBD (GST)) was assessed in competition...
Ligand InfoPC cidPC sid
In DepthDetails US Patent
TargetPotassium voltage-gated channel subfamily H member 2(Homo sapiens (Human))
Astrazeneca
US Patent
LigandPNGBDBM361553((S)-3-((1R,3R)-1-(5-fluoro-2-(2-((3-fluoropropyl)(...)
Affinity DataIC50: >4.00E+4nM. Assay description: hERG (human ether a go go-related gene) potassium channels are essential for normal electrical activity in the heart. Arrhythmia can be induced by a ...
Ligand InfoPC cidPC sid
In DepthDetails US Patent
TargetEstrogen receptor(Homo sapiens (Human))
Astrazeneca
US Patent
LigandPNGBDBM361553((S)-3-((1R,3R)-1-(5-fluoro-2-(2-((3-fluoropropyl)(...)
Affinity DataIC50:  2.10nM. Assay description: The ability of compounds to bind to isolated Estrogen Receptor Alpha Ligand binding domain (ER alpha-LBD (GST)) was assessed in competition assays us...
Ligand InfoPC cidPC sid
In DepthDetails US Patent
TargetEstrogen receptor(Homo sapiens (Human))
Astrazeneca
US Patent
LigandPNGBDBM361553((S)-3-((1R,3R)-1-(5-fluoro-2-(2-((3-fluoropropyl)(...)
Affinity DataIC50:  1.10nM. Assay description: The ability of compounds to bind to isolated Estrogen Receptor Alpha Ligand binding domain (ER alpha-LBD (GST)) was assessed in competition assays us...
Ligand InfoPC cidPC sid
In DepthDetails US Patent
TargetPotassium voltage-gated channel subfamily H member 2(Homo sapiens (Human))
Astrazeneca
US Patent
LigandPNGBDBM361553((S)-3-((1R,3R)-1-(5-fluoro-2-(2-((3-fluoropropyl)(...)
Affinity DataIC50: >4.00E+4nM. Assay description: hERG (human ether a go go-related gene) potassium channels are essential for normal electrical activity in the heart. Arrhythmia can be induced by a ...
Ligand InfoPC cidPC sid
In DepthDetails US Patent
TargetPotassium voltage-gated channel subfamily H member 2(Homo sapiens (Human))
Astrazeneca
US Patent
LigandPNGBDBM361553((S)-3-((1R,3R)-1-(5-fluoro-2-(2-((3-fluoropropyl)(...)
Affinity DataIC50: >4.00E+4nM. Assay description: hERG: The purpose of the hERG binding assay is to evaluate the effects of test compounds on the voltage-dependent potassium channel encoded by the hu...
Ligand InfoPC cidPC sid
In DepthDetails US Patent