BDBM361563 (2R)-3-[(1R,3R)-6-fluoro-1-[5-fluoro-2-[2-[3-fluoropropyl(methyl)amino]ethoxy]-3-methyl-4-pyridyl]-3-methyl-1,3,4,9-tetrahydropyrido[3,4-b]indol-2-yl]-2-methyl-propanoic acid::US10221173, Example 155::US10590132, Example 155::US11046689, Example 155
SMILES C[C@H](CN1[C@H](C)Cc2c([nH]c3ccc(F)cc23)[C@H]1c1c(F)cnc(OCCN(C)CCCF)c1C)C(O)=O
InChI Key
Data  4 IC50
  Tab Delimited (TSV)   2D SDfile   Computed 3D by Vconf -m prep SDfile
Find this compound or compounds like it in BindingDB:
Activity Spreadsheet -- Enzyme Inhibition Constant Data from BindingDB
Found 4 hits for monomerid = 361563
TargetEstrogen receptor(Homo sapiens (Human))
Astrazeneca
US Patent
LigandPNGBDBM361563((2R)-3-[(1R,3R)-6-fluoro-1-[5-fluoro-2-[2-[3-fluor...)
Affinity DataIC50:  1nM. Assay description: The ability of compounds to bind to isolated Estrogen Receptor Alpha Ligand binding domain (ER alpha—LBD (GST)) was assessed in competition assays us...
Ligand InfoPC cidPC sid
In DepthDetails US Patent
TargetEstrogen receptor(Homo sapiens (Human))
Astrazeneca
US Patent
LigandPNGBDBM361563((2R)-3-[(1R,3R)-6-fluoro-1-[5-fluoro-2-[2-[3-fluor...)
Affinity DataIC50:  1nM. Assay description: The ability of compounds to bind to isolated Estrogen Receptor Alpha Ligand binding domain (ER alpha-LBD (GST)) was assessed in competition assays us...
Ligand InfoPC cidPC sid
In DepthDetails US Patent
TargetEstrogen receptor [307-554](Homo sapiens (Human))
Astrazeneca
US Patent
LigandPNGBDBM361563((2R)-3-[(1R,3R)-6-fluoro-1-[5-fluoro-2-[2-[3-fluor...)
Affinity DataIC50:  1nM. Assay description: ERα: The ability of compounds to bind to isolated Estrogen Receptor Alpha Ligand binding domain (ER alpha-LBD (GST)) was assessed in competition...
Ligand InfoPC cidPC sid
In DepthDetails US Patent
TargetEstrogen receptor(Homo sapiens (Human))
Astrazeneca
US Patent
LigandPNGBDBM361563((2R)-3-[(1R,3R)-6-fluoro-1-[5-fluoro-2-[2-[3-fluor...)
Affinity DataIC50:  0.210nM. Assay description: The ability of compounds to down-regulate Estrogen Receptor (ER) numbers was assessed in a cell based immuno-fluorescence assay using the MCF-7 human...
Ligand InfoPC cidPC sid
In DepthDetails US Patent