BDBM36439 CID7100106::ZINC04105014, 3
SMILES [O-]C(=O)[C@H]1C[C@H]1C(=O)Nc1cc(F)ccc1F
InChI Key InChIKey=QTWGHTBKFVANGX-RQJHMYQMSA-M
Data  2 KI
  Tab Delimited (TSV)   2D SDfile   Computed 3D by Vconf -m prep SDfile
Find this compound or compounds like it in BindingDB:
Activity Spreadsheet -- Enzyme Inhibition Constant Data from BindingDB
Found 2 hits for monomerid = 36439
TargetBeta-lactamase(Escherichia coli)
University of California San Francisco
LigandPNGBDBM36439(CID7100106 | ZINC04105014, 3)
Affinity DataKi:  3.10E+6nMpH: 7.0Assay Description:Class C Beta-lactamase AmpC inhibition assay
In DepthDetails ArticlePubMed
TargetBeta-lactamase CTX-M-1(Escherichia coli)
University of California San Francisco
LigandPNGBDBM36439(CID7100106 | ZINC04105014, 3)
Affinity DataKi:  3.10E+6nMpH: 7.0Assay Description:Class A Beta-lactamase CTX-M inhibition assay
In DepthDetails ArticlePubMed