BDBM36441 CID25181261::ZINC01707328, 5
SMILES [O-]C(=O)CN1C(=O)O[C@H](C1=O)c1ccccc1
InChI Key InChIKey=BOCMLQYREYMDBY-VIFPVBQESA-M
Data  2 KI
  Tab Delimited (TSV)   2D SDfile   Computed 3D by Vconf -m prep SDfile
Find this compound or compounds like it in BindingDB:
Activity Spreadsheet -- Enzyme Inhibition Constant Data from BindingDB
Found 2 hits for monomerid = 36441
TargetBeta-lactamase CTX-M-1(Escherichia coli)
University of California San Francisco
LigandPNGBDBM36441(CID25181261 | ZINC01707328, 5)
Affinity DataKi:  7.00E+5nMpH: 7.0Assay Description:Class A Beta-lactamase CTX-M inhibition assay
In DepthDetails ArticlePubMed
TargetBeta-lactamase(Escherichia coli)
University of California San Francisco
LigandPNGBDBM36441(CID25181261 | ZINC01707328, 5)
Affinity DataKi:  3.50E+6nMpH: 7.0Assay Description:Class C Beta-lactamase AmpC inhibition assay
In DepthDetails ArticlePubMed