BDBM36443 CID7348363::ZINC04753704, 7
SMILES Nc1sc2CCCCc2c1-c1nn[n-]n1
InChI Key InChIKey=CPJRURCLEQHQRA-UHFFFAOYSA-N
Data  1 KI
  Tab Delimited (TSV)   2D SDfile   Computed 3D by Vconf -m prep SDfile
Find this compound or compounds like it in BindingDB:
Activity Spreadsheet -- Enzyme Inhibition Constant Data from BindingDB
Found 1 hit for monomerid = 36443
TargetBeta-lactamase CTX-M-1(Escherichia coli)
University of California San Francisco
LigandPNGBDBM36443(CID7348363 | ZINC04753704, 7)
Affinity DataKi:  3.00E+6nMpH: 7.0Assay Description:Class A Beta-lactamase CTX-M inhibition assay
In DepthDetails ArticlePubMed