BDBM36446 CID1714428::ZINC02028932, 10
SMILES [O-]S(=O)(=O)[C@H]1CC(=O)C(=O)c2ccccc12
InChI Key InChIKey=GPGQGNSBDPJXPW-VIFPVBQESA-M
Data  1 KI
  Tab Delimited (TSV)   2D SDfile   Computed 3D by Vconf -m prep SDfile
Find this compound or compounds like it in BindingDB:
Activity Spreadsheet -- Enzyme Inhibition Constant Data from BindingDB
Found 1 hit for monomerid = 36446
TargetBeta-lactamase CTX-M-1(Escherichia coli)
University of California San Francisco
LigandPNGBDBM36446(CID1714428 | ZINC02028932, 10)
Affinity DataKi:  7.00E+5nMpH: 7.0Assay Description:Class A Beta-lactamase CTX-M inhibition assay
In DepthDetails ArticlePubMed