BDBM36449 CID25181262::ZINC12596968, 13
SMILES Cn1cc(C(=O)Nc2cccc(c2)-c2nn[n-]n2)c2ccccc12
InChI Key InChIKey=PVDIUAVVEBMUKR-UHFFFAOYSA-M
Data  1 KI
  Tab Delimited (TSV)   2D SDfile   Computed 3D by Vconf -m prep SDfile
Find this compound or compounds like it in BindingDB:
Activity Spreadsheet -- Enzyme Inhibition Constant Data from BindingDB
Found 1 hit for monomerid = 36449
TargetBeta-lactamase CTX-M-1(Escherichia coli)
University of California San Francisco
LigandPNGBDBM36449(CID25181262 | ZINC12596968, 13)
Affinity DataKi:  1.00E+4nMpH: 7.0Assay Description:Class A Beta-lactamase CTX-M inhibition assay
In DepthDetails ArticlePubMed