BDBM365881 2-[4-({[(4- hydroxyphenyl)methyl]amino} methyl)-3,5- dimethoxyphenoxymethyl]-6- phenylbenzonitrile::US9872852, Example 133
SMILES COc1cc(OCc2cccc(-c3ccccc3)c2C#N)cc(OC)c1CNCc1ccc(O)cc1
InChI Key InChIKey=PQKOCOSLDBIXGO-UHFFFAOYSA-N
Data  1 IC50
  Tab Delimited (TSV)   2D SDfile   Computed 3D by Vconf -m prep SDfile
Find this compound or compounds like it in BindingDB:
Activity Spreadsheet -- Enzyme Inhibition Constant Data from BindingDB
Found 1 hit for monomerid = 365881
TargetProgrammed cell death 1 ligand 1(Homo sapiens (Human))
Bristol-Myers Squibb
US Patent
LigandPNGBDBM365881(2-[4-({[(4- hydroxyphenyl)methyl]amino} methyl)-3,...)
Affinity DataIC50:  555nM. Assay description: All binding studies were performed in an HTRF assay buffer consisting of dPBS supplemented with 0.1% (withv) bovine serum albumin and 0.05% (v/v) Twe...
Ligand InfoPC cidPC sid
In DepthDetails US Patent