BDBM367678 (R)-1-(((R)-1-((4-(2-(bis(pyridin-2-ylmethyl)amino)acetamido)phenethyl)amino)-1-oxopropan-2-yl)amino)-1-oxopropan-2-aminium chloride (OAA4033)::US10227327, Example 24
SMILES C[C@@H]([NH3+])C(=O)N[C@H](C)C(=O)NCCc1ccc(NC(=O)CN(Cc2ccccn2)Cc2ccccn2)cc1
InChI Key InChIKey=CQXFCNRCSRXJEU-NHCUHLMSSA-O
Data  3 IC50
  Tab Delimited (TSV)   2D SDfile   Computed 3D by Vconf -m prep SDfile
Find this compound or compounds like it in BindingDB:
Activity Spreadsheet -- Enzyme Inhibition Constant Data from BindingDB
Found 3 hits for monomerid = 367678
TargetMetallo-beta-lactamase type 2(Klebsiella pneumoniae)
Universitetet | Oslo
US Patent
LigandPNGBDBM367678((R)-1-(((R)-1-((4-(2-(bis(pyridin-2-ylmethyl)amino...)
Affinity DataIC50:  520nM. Assay description: a. Transfer 50 μl LB with 0.8 mM IPTG (0.4 mM final concentration in assay) to each wellb. Add 1 μl inhibitor/positive control (500/1000 &#...
Ligand InfoPC cidPC sid
In DepthDetails US Patent
TargetMetallo-beta-lactamase GIM-1(Pseudomonas aeruginosa)
Universitetet | Oslo
US Patent
LigandPNGBDBM367678((R)-1-(((R)-1-((4-(2-(bis(pyridin-2-ylmethyl)amino...)
Affinity DataIC50:  400nM. Assay description: a. Transfer 50 μl LB with 0.8 mM IPTG (0.4 mM final concentration in assay) to each wellb. Add 1 μl inhibitor/positive control (500/1000 &#...
Ligand InfoPC cidPC sid
In DepthDetails US Patent
TargetVIM-2 type metallo-beta-lactamase(Pseudomonas aeruginosa)
Universitetet | Oslo
US Patent
LigandPNGBDBM367678((R)-1-(((R)-1-((4-(2-(bis(pyridin-2-ylmethyl)amino...)
Affinity DataIC50:  2.28E+4nM. Assay description: a. Transfer 50 μl LB with 0.8 mM IPTG (0.4 mM final concentration in assay) to each wellb. Add 1 μl inhibitor/positive control (500/1000 &#...
Ligand InfoPC cidPC sid
In DepthDetails US Patent