BDBM367684 1-(1-(2,4-dimethoxyphenyl)-1H-1,2,3-triazol-4-yl)-N,N-bis(pyridin-2-ylmethyl)methanamine (OAA4081)::US10227327, Example 11
SMILES COc1ccc(c(OC)c1)-n1cc(CN(Cc2ccccn2)Cc2ccccn2)nn1
InChI Key InChIKey=YEMYUPFVFGUWTG-UHFFFAOYSA-N
Data  2 IC50
  Tab Delimited (TSV)   2D SDfile   Computed 3D by Vconf -m prep SDfile
Find this compound or compounds like it in BindingDB:
Activity Spreadsheet -- Enzyme Inhibition Constant Data from BindingDB
Found 2 hits for monomerid = 367684
TargetMetallo-beta-lactamase GIM-1(Pseudomonas aeruginosa)
Universitetet | Oslo
US Patent
LigandPNGBDBM367684(1-(1-(2,4-dimethoxyphenyl)-1H-1,2,3-triazol-4-yl)-...)
Affinity DataIC50:  860nM. Assay description: a. Transfer 50 μl LB with 0.8 mM IPTG (0.4 mM final concentration in assay) to each wellb. Add 1 μl inhibitor/positive control (500/1000 &#...
Ligand InfoPC cidPC sid
In DepthDetails US Patent
TargetVIM-2 type metallo-beta-lactamase(Pseudomonas aeruginosa)
Universitetet | Oslo
US Patent
LigandPNGBDBM367684(1-(1-(2,4-dimethoxyphenyl)-1H-1,2,3-triazol-4-yl)-...)
Affinity DataIC50:  1.22E+4nM. Assay description: a. Transfer 50 μl LB with 0.8 mM IPTG (0.4 mM final concentration in assay) to each wellb. Add 1 μl inhibitor/positive control (500/1000 &#...
Ligand InfoPC cidPC sid
In DepthDetails US Patent