BDBM36812 CA-074
SMILES CCCNC1OC1C(=O)N[C@@H](C(C)CC)C(=O)N1CCC[C@@H]1C(O)=O
InChI Key InChIKey=VPFNOFSJVAOADU-JARZNLENSA-N
Data  2 IC50
  Tab Delimited (TSV)   2D SDfile   Computed 3D by Vconf -m prep SDfile
Find this compound or compounds like it in BindingDB:
Activity Spreadsheet -- Enzyme Inhibition Constant Data from BindingDB
Found 2 hits for monomerid = 36812
TargetProcathepsin L [114-333,T223A](Homo sapiens (Human))
University of California San Francisco
LigandPNGBDBM36812(CA-074)
Affinity DataIC50: >1.00E+4nMpH: 5.5 T: 2°C. Assay description: Inhibition assay using pre-treatment of recombinant cathepsin-L-like cysteine protease cruzain lacking the carboxy-terminal domain or cathepsin B fr...
In DepthDetails ArticlePubMed
TargetCathepsin B(Homo sapiens (Human))
University of California San Francisco
LigandPNGBDBM36812(CA-074)
Affinity DataIC50:  40nMpH: 5.5 T: 2°C. Assay description: Inhibition assay using pre-treatment of recombinant cathepsin-L-like cysteine protease cruzain lacking the carboxy-terminal domain or cathepsin B fr...
In DepthDetails ArticlePubMed