BDBM368200 3-(3-Hydroxyphenyl)-4-methyl-2-(4-(2-(3-methylazetidin-1-yl)ethoxy)phenyl)-2H-chromen-6-ol::US10227334, Example 4
SMILES CC1CN(CCOc2ccc(cc2)C2Oc3ccc(O)cc3C(C)=C2c2cccc(O)c2)C1
InChI Key InChIKey=ABKNJRSWPKAULO-UHFFFAOYSA-N
Data  2 IC50
  Tab Delimited (TSV)   2D SDfile   Computed 3D by Vconf -m prep SDfile
Find this compound or compounds like it in BindingDB:
Activity Spreadsheet -- Enzyme Inhibition Constant Data from BindingDB
Found 2 hits for monomerid = 368200
TargetEstrogen receptor(Homo sapiens (Human))
TBA
Curated by ChEMBL
LigandPNGBDBM368200(3-(3-Hydroxyphenyl)-4-methyl-2-(4-(2-(3-methylazet...)
Affinity DataIC50:  0.300nM. Assay description: Induction of ERalpha degradation in human MCF7 cells in phenol red free RPMI medium containing 5% charcoal dextran-treated FBS incubated for 4 hrs by...
Ligand InfoPC cidPC sid
In DepthDetails ArticlePubMed
TargetEstrogen receptor(Homo sapiens (Human))
TBA
Curated by ChEMBL
LigandPNGBDBM368200(3-(3-Hydroxyphenyl)-4-methyl-2-(4-(2-(3-methylazet...)
Affinity DataIC50:  200nM. Assay description: MCF-7 cells were adjusted to a concentration of 40,000 cells per mL in RPMI containing 10% FBS and 20 mM HEPES. 16 microliters of the cell suspension...
Ligand InfoPC cidPC sid
In DepthDetails US Patent