BDBM372804 (1S,5S,6S)-3-amino-5-(5-((Z)-2-(5-cyanothiophen-2-yl)-2-fluorovinyl)-2-fluorophenyl)-N,N,5-trimethyl-2-thia-4-azabicyclo[4.1.0]hept-3-ene-1-carboxamide::US10246429, Example 220
SMILES CN(C)C(=O)[C@]12C[C@H]1[C@](C)(N=C(N)S2)c1cc(\C=C(/F)c2ccc(s2)C#N)ccc1F
InChI Key InChIKey=KADCOBWPLLZJEJ-LLYJTOGPSA-N
Data  3 IC50
  Tab Delimited (TSV)   2D SDfile   Computed 3D by Vconf -m prep SDfile
Find this compound or compounds like it in BindingDB:
Activity Spreadsheet -- Enzyme Inhibition Constant Data from BindingDB
Found 3 hits for monomerid = 372804
TargetBeta-secretase 1(Homo sapiens (Human))
Amgen
US Patent
LigandPNGBDBM372804((1S,5S,6S)-3-amino-5-(5-((Z)-2-(5-cyanothiophen-2-...)
Affinity DataIC50:  11nM. Assay description: The cDNAs for both human recombinant BACE1 and 2 with C-terminal 6-His Tags were cloned into transient protein expression vectors, which were subsequ...
Ligand InfoPC cidPC sid
In DepthDetails US Patent
TargetCathepsin D(Homo sapiens (Human))
Amgen
US Patent
LigandPNGBDBM372804((1S,5S,6S)-3-amino-5-(5-((Z)-2-(5-cyanothiophen-2-...)
Affinity DataIC50:  2.64E+4nM. Assay description: Recombinant Cat D was expressed in CHO cells. The assay buffer for CatD is 0.05M citrate pH 3.5, 10% DMSO final, 5 mM CHAPS. The CatD enzyme (9 nM) i...
Ligand InfoPC cidPC sid
In DepthDetails US Patent
TargetBeta-secretase 2(Homo sapiens (Human))
Amgen
US Patent
LigandPNGBDBM372804((1S,5S,6S)-3-amino-5-(5-((Z)-2-(5-cyanothiophen-2-...)
Affinity DataIC50:  2nM
Ligand InfoPC cidPC sid
In DepthDetails US Patent