BDBM373081 US10851080, Example 29::US9896435, Example 29
SMILES COCCN1C[C@@H](NC(=O)Nc2c(C)c(nn2-c2ccccc2)-c2cc(C)c(=O)n(C)c2)[C@@H](C1)c1ccc(F)c(F)c1
InChI Key InChIKey=MCIDEPHJYIOTSY-RPLLCQBOSA-N
Data  2 IC50
  Tab Delimited (TSV)   2D SDfile   Computed 3D by Vconf -m prep SDfile
Find this compound or compounds like it in BindingDB:
Activity Spreadsheet -- Enzyme Inhibition Constant Data from BindingDB
Found 2 hits for monomerid = 373081
TargetHigh affinity nerve growth factor receptor(Homo sapiens (Human))
Array Biopharma
US Patent
LigandPNGBDBM373081(US10851080, Example 29 | US9896435, Example 29)
Affinity DataIC50: <100nM. Assay description: TrkA binding activity was determined in a TrkA LanthaScreen™ Eu Kinase Binding Assay. 5 nM His-tagged recombinant human TrkA (6HIS tagged cytoplasmic...
Ligand InfoPC cidPC sid
In DepthDetails US Patent
TargetHigh affinity nerve growth factor receptor(Homo sapiens (Human))
Array Biopharma
US Patent
LigandPNGBDBM373081(US10851080, Example 29 | US9896435, Example 29)
Affinity DataIC50: <100nM. Assay description: TrkA binding activity was determined in a TrkA LanthaScreen™ Eu Kinase Binding Assay. 5 nM His-tagged recombinant human TrkA (6HIS tagged cytoplasmic...
Ligand InfoPC cidPC sid
In DepthDetails US Patent