BDBM374319 (6-(6-(6-(1-aminocyclopentyl)pyridin-2-yl)-4-(2-methoxyethoxy)-1H-indazol-1-yl)pyridin-2-yl)methanol::US10246456, Example 469::US10577367, Example 469
SMILES COCCOc1cc(cc2n(ncc12)-c1cccc(CO)n1)-c1cccc(n1)C1(N)CCCC1
InChI Key InChIKey=BFZJOAYCYKHKDB-UHFFFAOYSA-N
Data  2 IC50
  Tab Delimited (TSV)   2D SDfile   Computed 3D by Vconf -m prep SDfile
Find this compound or compounds like it in BindingDB:
Activity Spreadsheet -- Enzyme Inhibition Constant Data from BindingDB
Found 2 hits for monomerid = 374319
TargetInterleukin-1 receptor-associated kinase 4(Homo sapiens (Human))
Biogen Ma
US Patent
LigandPNGBDBM374319((6-(6-(6-(1-aminocyclopentyl)pyridin-2-yl)-4-(2-me...)
Affinity DataIC50: <100nM. Assay description: The biochemical assay is in a AlphaScreen format. The kinase reaction is based on the IRAK-4 phosphorylation of a biotin labeled peptide. The phospho...
Ligand InfoPC cidPC sid
In DepthDetails US Patent
TargetInterleukin-1 receptor-associated kinase 4(Homo sapiens (Human))
Biogen Ma
US Patent
LigandPNGBDBM374319((6-(6-(6-(1-aminocyclopentyl)pyridin-2-yl)-4-(2-me...)
Affinity DataIC50: <100nM. Assay description: The biochemical assay is in a AlphaScreen format. The kinase reaction is based on the IRAK-4 phosphorylation of a biotin labeled peptide. The phospho...
Ligand InfoPC cidPC sid
In DepthDetails US Patent