BDBM374398 US10246456, Example 578::US10577367, Example 578
SMILES CCC[C@H](N)c1cccc(n1)-c1cc(-n2ccnn2)c2cnn(-c3cccc(CO)n3)c2c1
InChI Key InChIKey=ASEBXLRAISRYOX-IBGZPJMESA-N
Data  2 IC50
  Tab Delimited (TSV)   2D SDfile   Computed 3D by Vconf -m prep SDfile
Find this compound or compounds like it in BindingDB:
Activity Spreadsheet -- Enzyme Inhibition Constant Data from BindingDB
Found 2 hits for monomerid = 374398
TargetInterleukin-1 receptor-associated kinase 4(Homo sapiens (Human))
Biogen Ma
US Patent
LigandPNGBDBM374398(US10246456, Example 578 | US10577367, Example 578)
Affinity DataIC50: <100nM. Assay description: The biochemical assay is in a AlphaScreen format. The kinase reaction is based on the IRAK-4 phosphorylation of a biotin labeled peptide. The phospho...
Ligand InfoPC cidPC sid
In DepthDetails US Patent
TargetInterleukin-1 receptor-associated kinase 4(Homo sapiens (Human))
Biogen Ma
US Patent
LigandPNGBDBM374398(US10246456, Example 578 | US10577367, Example 578)
Affinity DataIC50: <100nM. Assay description: The biochemical assay is in a AlphaScreen format. The kinase reaction is based on the IRAK-4 phosphorylation of a biotin labeled peptide. The phospho...
Ligand InfoPC cidPC sid
In DepthDetails US Patent