BDBM375098 US10253004, Example 12
SMILES Cc1cc(OCC2(O)CCS(=O)(=O)CC2)cc(C)c1-c1ccc(F)c2[C@@H](CCc12)Nc1cnc(cn1)[C@H]1C[C@@H]1C(O)=O
InChI Key InChIKey=IKPRUNYCZRGQAC-SONWIMMPSA-N
Data  1 EC50
  Tab Delimited (TSV)   2D SDfile   Computed 3D by Vconf -m prep SDfile
Find this compound or compounds like it in BindingDB:
Activity Spreadsheet -- Enzyme Inhibition Constant Data from BindingDB
Found 1 hit for monomerid = 375098
TargetFree fatty acid receptor 1(Homo sapiens (Human))
Boehringer Ingelheim International
US Patent
LigandPNGBDBM375098(US10253004, Example 12)
Affinity DataEC50:  14nM. Assay description: IP1 accumulation measurements using the IPOne assay system—1321N1 cells stably expressing human GPR40 receptor (Euroscreen, Belgium) are seeded 24 h ...
Ligand InfoPC cidPC sid
In DepthDetails US Patent