BDBM375102 US10253004, Example 16
SMILES OC(=O)[C@H]1C[C@@H]1c1cnc(N[C@@H]2CCc3c2c(F)ccc3-c2c(F)cccc2F)cn1
InChI Key InChIKey=KZPODKHPEIUJHY-SUNYJGFJSA-N
Data  1 EC50
  Tab Delimited (TSV)   2D SDfile   Computed 3D by Vconf -m prep SDfile
Find this compound or compounds like it in BindingDB:
Activity Spreadsheet -- Enzyme Inhibition Constant Data from BindingDB
Found 1 hit for monomerid = 375102
TargetFree fatty acid receptor 1(Homo sapiens (Human))
Boehringer Ingelheim International
US Patent
LigandPNGBDBM375102(US10253004, Example 16)
Affinity DataEC50:  77nM. Assay description: IP1 accumulation measurements using the IPOne assay system—1321N1 cells stably expressing human GPR40 receptor (Euroscreen, Belgium) are seeded 24 h ...
Ligand InfoPC cidPC sid
In DepthDetails US Patent