BDBM37787 1-allyl-2-(butylthio)-6-hydroxy-pyrimidin-4-one::2-(butylthio)-6-hydroxy-1-prop-2-enyl-4-pyrimidinone::2-butylsulfanyl-6-hydroxy-1-prop-2-enylpyrimidin-4-one::2-butylsulfanyl-6-oxidanyl-1-prop-2-enyl-pyrimidin-4-one::MLS000114539::SMR000091904::cid_1618319
SMILES CCCCSc1nc(O)cc(=O)n1CC=C
InChI Key InChIKey=BXPFOURZBFIMBA-UHFFFAOYSA-N
Data  2 KI  2 IC50
  Tab Delimited (TSV)   2D SDfile   Computed 3D by Vconf -m prep SDfile
Find this compound or compounds like it in BindingDB:
Activity Spreadsheet -- Enzyme Inhibition Constant Data from BindingDB
Found 2 hits for monomerid = 37787
TargetN-formyl peptide receptor 2(Homo sapiens (Human))
Nmmlsc
Curated by PubChem BioAssay
LigandPNGBDBM37787(1-allyl-2-(butylthio)-6-hydroxy-pyrimidin-4-one | ...)
Affinity DataIC50: >6.67E+4nM. Assay description: University of New Mexico Assay Overview Assay Support: NIH 1R03MH076381-01 Assay for Formylpeptide Receptor Family Ligands PI: Bruce S. Edwards, Ph....
In DepthDetails PCBioAssay
TargetfMet-Leu-Phe receptor(Homo sapiens (Human))
Nmmlsc
Curated by PubChem BioAssay
LigandPNGBDBM37787(1-allyl-2-(butylthio)-6-hydroxy-pyrimidin-4-one | ...)
Affinity DataIC50:  3.03E+4nM. Assay description: University of New Mexico Assay Overview: Assay Support: NIH 1R03MH076381-01 Assay for Formylpeptide Receptor Family Ligands PI: Bruce S. Edwards, Ph...
In DepthDetails PCBioAssay