BDBM378854 US10266528, Compound 10
SMILES CC(C)(C)c1noc(n1)C(=O)NCc1ccc(c(CO)c1)-c1ccnc2[nH]c(=O)[nH]c12
InChI Key InChIKey=YRDACDSBCNGXIY-UHFFFAOYSA-N
Data  1 IC50
  Tab Delimited (TSV)   2D SDfile   Computed 3D by Vconf -m prep SDfile
Find this compound or compounds like it in BindingDB:
Activity Spreadsheet -- Enzyme Inhibition Constant Data from BindingDB
Found 1 hit for monomerid = 378854
TargetTyrosine-protein kinase BTK(Homo sapiens (Human))
Merck Patent
US Patent
LigandPNGBDBM378854(US10266528, Compound 10)
Affinity DataIC50: >1.00E+3nM. Assay description: Briefly, 2.5× stocks of full-length human BTK (08-080) from CarnaBio USA, Inc., Natick, Mass., 1.6×ATP and appropriate kinKDR peptide substrate (FITC...
Ligand InfoPC cidPC sid
In DepthDetails US Patent