BDBM379259 US10266549, Example 158a::US10774092, Example 158a
SMILES FC(F)(F)c1cnc(Nc2ccc3OCCOc3c2)nc1NC1CC1
InChI Key InChIKey=PIXMXXAIRNOCBS-UHFFFAOYSA-N
Data  4 IC50
  Tab Delimited (TSV)   2D SDfile   Computed 3D by Vconf -m prep SDfile
Find this compound or compounds like it in BindingDB:
Activity Spreadsheet -- Enzyme Inhibition Constant Data from BindingDB
Found 4 hits for monomerid = 379259
TargetSerine/threonine-protein kinase ULK1(Homo sapiens (Human))
Salk Institute
US Patent
LigandPNGBDBM379259(US10266549, Example 158a | US10774092, Example 158...)
Affinity DataIC50: <200nM. Assay description: Gamma-32P assays to measure ULK1 kinase activity were performed as previously described. Briefly, Flag ULK1 was transfected into HEK293T cells and 20...
Ligand InfoPC cidPC sid
In DepthDetails US Patent
TargetSerine/threonine-protein kinase ULK1(Homo sapiens (Human))
Salk Institute
US Patent
LigandPNGBDBM379259(US10266549, Example 158a | US10774092, Example 158...)
Affinity DataIC50:  4.48E+3nM. Assay description: Inhibition of ULK1 (unknown origin) expressed in HEK293T cells incubated for 2 hrs by NanoBRET assay
Ligand InfoPC cidPC sid
In DepthDetails ArticlePubMed
TargetSerine/threonine-protein kinase ULK1(Homo sapiens (Human))
Salk Institute
US Patent
LigandPNGBDBM379259(US10266549, Example 158a | US10774092, Example 158...)
Affinity DataIC50:  14nM. Assay description: Inhibition of recombinant human ULK1 (1-649) expressed in Sf9 cells using myelin basic protein as substrate by ADP-glo assay
Ligand InfoPC cidPC sid
In DepthDetails ArticlePubMed
TargetSerine/threonine-protein kinase ULK1(Homo sapiens (Human))
Salk Institute
US Patent
LigandPNGBDBM379259(US10266549, Example 158a | US10774092, Example 158...)
Affinity DataIC50: <200nM. Assay description: ULK1 inhibition assay is a screening assay to identify compounds that inhibit kinase activity of ULK1 using the ULKtide peptide. In some embodiments,...
Ligand InfoPC cidPC sid
In DepthDetails US Patent