BDBM379555 US9926281, Compound 34
SMILES Clc1cccc(c1)N1CCN(CC1)C(=O)CCC1(NC(=O)NC1=O)C1CC1
InChI Key InChIKey=SZEOXTMGYZKQHV-UHFFFAOYSA-N
Data  14 IC50
  Tab Delimited (TSV)   2D SDfile   Computed 3D by Vconf -m prep SDfile
Find this compound or compounds like it in BindingDB:
Activity Spreadsheet -- Enzyme Inhibition Constant Data from BindingDB
Found 14 hits for monomerid = 379555
TargetADAMTS5(Rattus norvegicus (Rat))
Galapagos
US Patent
LigandPNGBDBM379555(US9926281, Compound 34)
Affinity DataIC50:  41nM. Assay description: ADAMTS-4:The basis for the assay is the cleavage of the substrate TBIS-1 (5-FAM-TEGEARGSVILLK (5TAMRA)K-NH2) (SEQ ID No 2) by human ADAMTS4For the do...
Ligand InfoPC cidPC sid
In DepthDetails US Patent
TargetA disintegrin and metalloproteinase with thrombospondin motifs 5(Homo sapiens (Human))
Galapagos
US Patent
LigandPNGBDBM379555(US9926281, Compound 34)
Affinity DataIC50:  39nM. Assay description: ADAMTS-5:Protocol 1: The basis for the assay is the cleavage of the substrate TBIS-1 (5 FAM-TEGEARGSVILLK (5TAMRA)K-NH2) (SEQ ID No 2) by human ADAMT...
Ligand InfoPC cidPC sid
In DepthDetails US Patent
TargetA disintegrin and metalloproteinase with thrombospondin motifs 5(Homo sapiens (Human))
Galapagos
US Patent
LigandPNGBDBM379555(US9926281, Compound 34)
Affinity DataIC50:  73nM. Assay description: ADAMTS-5:Protocol 2: The basis for the assay is the cleavage of the substrate TBIS-1 (5 FAM-TEGEARGSVILLK (5TAMRA)K-NH2) (SEQ ID No 2) by human ADAMT...
Ligand InfoPC cidPC sid
In DepthDetails US Patent
TargetDisintegrin and metalloproteinase domain-containing protein 17(Homo sapiens (Human))
Galapagos
US Patent
LigandPNGBDBM379555(US9926281, Compound 34)
Affinity DataIC50: >4.00E+3nM. Assay description: TACE:The basis for the assay is the cleavage of the substrate 5FAM-LAQAVRSSSRK-5TAMRA (SEQ ID No 3) (Anaspec, custom 34891) by human TACE (R&D SYSTEM...
Ligand InfoPC cidPC sid
In DepthDetails US Patent
Target72 kDa type IV collagenase(Homo sapiens (Human))
Galapagos
US Patent
LigandPNGBDBM379555(US9926281, Compound 34)
Affinity DataIC50:  220nM. Assay description: MMP2: Protocol 1: The basis for the assay is the cleavage of the substrate 520 MMP fret substrate XV (Anaspec, Catalog #: AS-60582-01) by human MMP2 ...
Ligand InfoPC cidPC sid
In DepthDetails US Patent
Target72 kDa type IV collagenase(Homo sapiens (Human))
Galapagos
US Patent
LigandPNGBDBM379555(US9926281, Compound 34)
Affinity DataIC50:  489nM. Assay description: MMP2: Protocol 2: The basis for the assay is the cleavage of the substrate 390 MMP FRET substrate I (Anaspec, Catalog n#: AS-27076) by human MMP2 (R&...
Ligand InfoPC cidPC sid
In DepthDetails US Patent
TargetA disintegrin and metalloproteinase with thrombospondin motifs 5(Homo sapiens (Human))
Galapagos
US Patent
LigandPNGBDBM379555(US9926281, Compound 34)
Affinity DataIC50:  137nM. Assay description: Inhibition of human recombinant ADAMTS-5 assessed as cleavage of fluorescent substrate using FAM-TBIS-1 in presence of 2% HSA by biochemical assay
Ligand InfoPC cidPC sid
In DepthDetails ArticlePubMed
TargetA disintegrin and metalloproteinase with thrombospondin motifs 5(Homo sapiens (Human))
Galapagos
US Patent
LigandPNGBDBM379555(US9926281, Compound 34)
Affinity DataIC50:  41nM. Assay description: Inhibition of human recombinant ADAMTS-5 assessed as cleavage of fluorescent substrate using FAM-TBIS-1 by biochemical assay
Ligand InfoPC cidPC sid
In DepthDetails ArticlePubMed
TargetA disintegrin and metalloproteinase with thrombospondin motifs 1(Homo sapiens (Human))
Galapagos
Curated by ChEMBL
LigandPNGBDBM379555(US9926281, Compound 34)
Affinity DataIC50:  328nM. Assay description: Inhibition of human recombinant ADAMTS-1 (AA253 to 734) assessed as cleavage of fluorescent substrate using 5(6)-fluorescein-NH-AELQGRPISIAK-5(6)-TAM...
Ligand InfoPC cidPC sid
In DepthDetails ArticlePubMed
TargetA disintegrin and metalloproteinase with thrombospondin motifs 4(Homo sapiens (Human))
Galapagos
Curated by ChEMBL
LigandPNGBDBM379555(US9926281, Compound 34)
Affinity DataIC50:  25nM. Assay description: Inhibition of human recombinant ADAMTS-4 (AA1 to 520) assessed as cleavage of fluorescent substrate using as TBIS-1 substrate incubated for 180 mins ...
Ligand InfoPC cidPC sid
In DepthDetails ArticlePubMed
Target72 kDa type IV collagenase(Homo sapiens (Human))
Galapagos
US Patent
LigandPNGBDBM379555(US9926281, Compound 34)
Affinity DataIC50:  328nM. Assay description: Inhibition of human recombinant MMP2 (AA34 to 660) assessed as cleavage of fluorescent substrate using 390 MMP FRET as substrate incubated for 30 min...
Ligand InfoPC cidPC sid
In DepthDetails ArticlePubMed
TargetDisintegrin and metalloproteinase domain-containing protein 17(Homo sapiens (Human))
Galapagos
US Patent
LigandPNGBDBM379555(US9926281, Compound 34)
Affinity DataIC50: >4.00E+3nM. Assay description: Inhibition of human recombinant TACE (AA34 to 660) assessed as cleavage of fluorescent substrate using 5FAM-LAQAVRSSSRK-5TAMRA as substrate by bioche...
Ligand InfoPC cidPC sid
In DepthDetails ArticlePubMed
TargetA disintegrin and metalloproteinase with thrombospondin motifs 5(Homo sapiens (Human))
Galapagos
US Patent
LigandPNGBDBM379555(US9926281, Compound 34)
Affinity DataIC50:  155nM. Assay description: Inhibition of human recombinant ADAMTS-5 assessed as cleavage of fluorescent substrate using FAM-TBIS-1 in absence of serum by biochemical assay
Ligand InfoPC cidPC sid
In DepthDetails ArticlePubMed
TargetCollagenase 3(Homo sapiens (Human))
Galapagos
US Patent
LigandPNGBDBM379555(US9926281, Compound 34)
Affinity DataIC50:  3.21E+3nM. Assay description: MMP-13:The basis for the assay is the cleavage of the substrate 390 MMP FRET Substrate I (Anaspec Cat # AS-27076) by human MMP13 (Chemicon, Cat #CC06...
Ligand InfoPC cidPC sid
In DepthDetails US Patent