BDBM379975 US9926281, Compound 436
SMILES COCC(CC1(C)NC(=O)NC1=O)C(=O)N1CCN(CC1)c1cc(Cl)cc(Cl)c1
InChI Key InChIKey=OBQNFIXICFYDBT-UHFFFAOYSA-N
Data  10 IC50
  Tab Delimited (TSV)   2D SDfile   Computed 3D by Vconf -m prep SDfile
Find this compound or compounds like it in BindingDB:
Activity Spreadsheet -- Enzyme Inhibition Constant Data from BindingDB
Found 10 hits for monomerid = 379975
TargetA disintegrin and metalloproteinase with thrombospondin motifs 5(Homo sapiens (Human))
Galapagos
US Patent
LigandPNGBDBM379975(US9926281, Compound 436)
Affinity DataIC50:  22nM. Assay description: ADAMTS-5:Protocol 2: The basis for the assay is the cleavage of the substrate TBIS-1 (5 FAM-TEGEARGSVILLK (5TAMRA)K-NH2) (SEQ ID No 2) by human ADAMT...
Ligand InfoPC cidPC sid
In DepthDetails US Patent
TargetDisintegrin and metalloproteinase domain-containing protein 17(Homo sapiens (Human))
Galapagos
US Patent
LigandPNGBDBM379975(US9926281, Compound 436)
Affinity DataIC50:  368nM. Assay description: TACE:The basis for the assay is the cleavage of the substrate 5FAM-LAQAVRSSSRK-5TAMRA (SEQ ID No 3) (Anaspec, custom 34891) by human TACE (R&D SYSTEM...
Ligand InfoPC cidPC sid
In DepthDetails US Patent
Target72 kDa type IV collagenase(Homo sapiens (Human))
Galapagos
US Patent
LigandPNGBDBM379975(US9926281, Compound 436)
Affinity DataIC50: >4.00E+3nM. Assay description: MMP2: Protocol 2: The basis for the assay is the cleavage of the substrate 390 MMP FRET substrate I (Anaspec, Catalog n#: AS-27076) by human MMP2 (R&...
Ligand InfoPC cidPC sid
In DepthDetails US Patent
TargetCollagenase 3(Homo sapiens (Human))
Galapagos
US Patent
LigandPNGBDBM379975(US9926281, Compound 436)
Affinity DataIC50: >4.00E+3nM. Assay description: MMP-13:The basis for the assay is the cleavage of the substrate 390 MMP FRET Substrate I (Anaspec Cat # AS-27076) by human MMP13 (Chemicon, Cat #CC06...
Ligand InfoPC cidPC sid
In DepthDetails US Patent
TargetDisintegrin and metalloproteinase domain-containing protein 17(Homo sapiens (Human))
Galapagos
US Patent
LigandPNGBDBM379975(US9926281, Compound 436)
Affinity DataIC50:  368nM. Assay description: Inhibition of human recombinant TACE (AA34 to 660) assessed as cleavage of fluorescent substrate using 5FAM-LAQAVRSSSRK-5TAMRA as substrate by bioche...
Ligand InfoPC cidPC sid
In DepthDetails ArticlePubMed
TargetA disintegrin and metalloproteinase with thrombospondin motifs 5(Homo sapiens (Human))
Galapagos
US Patent
LigandPNGBDBM379975(US9926281, Compound 436)
Affinity DataIC50:  22nM. Assay description: Inhibition of human recombinant ADAMTS-5 assessed as cleavage of fluorescent substrate using FAM-TBIS-1 by biochemical assay
Ligand InfoPC cidPC sid
In DepthDetails ArticlePubMed
TargetA disintegrin and metalloproteinase with thrombospondin motifs 1(Homo sapiens (Human))
Galapagos
Curated by ChEMBL
LigandPNGBDBM379975(US9926281, Compound 436)
Affinity DataIC50: >4.00E+3nM. Assay description: Inhibition of human recombinant ADAMTS-1 (AA253 to 734) assessed as cleavage of fluorescent substrate using 5(6)-fluorescein-NH-AELQGRPISIAK-5(6)-TAM...
Ligand InfoPC cidPC sid
In DepthDetails ArticlePubMed
TargetA disintegrin and metalloproteinase with thrombospondin motifs 4(Homo sapiens (Human))
Galapagos
Curated by ChEMBL
LigandPNGBDBM379975(US9926281, Compound 436)
Affinity DataIC50:  12nM. Assay description: Inhibition of human recombinant ADAMTS-4 (AA1 to 520) assessed as cleavage of fluorescent substrate using as TBIS-1 substrate incubated for 180 mins ...
Ligand InfoPC cidPC sid
In DepthDetails ArticlePubMed
Target72 kDa type IV collagenase(Homo sapiens (Human))
Galapagos
US Patent
LigandPNGBDBM379975(US9926281, Compound 436)
Affinity DataIC50: >4.00E+3nM. Assay description: Inhibition of human recombinant MMP2 (AA34 to 660) assessed as cleavage of fluorescent substrate using 390 MMP FRET as substrate incubated for 30 min...
Ligand InfoPC cidPC sid
In DepthDetails ArticlePubMed
TargetMatrix metalloproteinase-14(Homo sapiens (Human))
Galapagos
US Patent
LigandPNGBDBM379975(US9926281, Compound 436)
Affinity DataIC50: >4.00E+3nM. Assay description: MMP-14:The basis for the assay is the cleavage of the substrate 390 MMP FRET Substrate I (Anaspec Cat # AS-27076) by human MMP14 (Biomol, Cat #SE-259...
Ligand InfoPC cidPC sid
In DepthDetails US Patent