BDBM380451 US9926306, ID 183-44
SMILES CC(C)(C)c1cs\c(=N/C2CCCCC2)n1\N=C\c1ccc(O)c(O)c1O
InChI Key InChIKey=VGZUOOKUVQJVNE-ZORVMIJESA-N
Data  1 IC50
  Tab Delimited (TSV)   2D SDfile   Computed 3D by Vconf -m prep SDfile
Find this compound or compounds like it in BindingDB:
Activity Spreadsheet -- Enzyme Inhibition Constant Data from BindingDB
Found 1 hit for monomerid = 380451
TargetInduced myeloid leukemia cell differentiation protein Mcl-1 homolog(Mus musculus (Mouse))
Dana-Farber Cancer Institute
US Patent
LigandPNGBDBM380451(US9926306, ID 183-44)
Affinity DataIC50:  540nM. Assay description: A high-throughput competitive fluorescence polarization (FP) screening assay (Z-factor, 0.62) was developed based on the direct binding interaction b...
Ligand InfoPC cidPC sid
In DepthDetails US Patent