BDBM380464 US9926306, ID 183-22
SMILES Oc1ccc(\C=N\n2c(cs\c2=N/C2CCCC2)C2CC2)c(O)c1O
InChI Key InChIKey=CVONJEGVLJAUIO-UTYDHLRSSA-N
Data  1 IC50
  Tab Delimited (TSV)   2D SDfile   Computed 3D by Vconf -m prep SDfile
Find this compound or compounds like it in BindingDB:
Activity Spreadsheet -- Enzyme Inhibition Constant Data from BindingDB
Found 1 hit for monomerid = 380464
TargetInduced myeloid leukemia cell differentiation protein Mcl-1 homolog(Mus musculus (Mouse))
Dana-Farber Cancer Institute
US Patent
LigandPNGBDBM380464(US9926306, ID 183-22)
Affinity DataIC50:  2.40nM. Assay description: A high-throughput competitive fluorescence polarization (FP) screening assay (Z-factor, 0.62) was developed based on the direct binding interaction b...
Ligand InfoPC cidPC sid
In DepthDetails US Patent