BDBM383181 US10278929, Meclofenamic acid
SMILES CC(=O)c1ccccc1Nc1c(O)ccc(C)c1Cl
InChI Key InChIKey=BLPMYBUALHCWOY-UHFFFAOYSA-N
Data  1 IC50
  Tab Delimited (TSV)   2D SDfile   Computed 3D by Vconf -m prep SDfile
Find this compound or compounds like it in BindingDB:
Activity Spreadsheet -- Enzyme Inhibition Constant Data from BindingDB
Found 1 hit for monomerid = 383181
TargetTransthyretin(Homo sapiens (Human))
The Board of Trustees of The Leland Stanford Junior University
US Patent
LigandPNGBDBM383181(US10278929, Meclofenamic acid)
Affinity DataIC50:  504nM. Assay description: The FP assay was then adapted for HTS and used to screen a ˜120,000 member small molecule library for compounds that displaced the FP probe from the ...
Ligand InfoPC cidPC sid
In DepthDetails US Patent