BDBM384561 6-chloro-N-[trans-4- (morpholin-4- yl)cyclohexyl]quinazolin- 4-amine::US9932350, 2-13
SMILES Clc1ccc2ncnc(N[C@H]3CC[C@@H](CC3)N3CCOCC3)c2c1
InChI Key InChIKey=PEBXDAAUGYCVMS-SHTZXODSSA-N
Data  1 IC50
  Tab Delimited (TSV)   2D SDfile   Computed 3D by Vconf -m prep SDfile
Find this compound or compounds like it in BindingDB:
Activity Spreadsheet -- Enzyme Inhibition Constant Data from BindingDB
Found 1 hit for monomerid = 384561
TargetInterleukin-1 receptor-associated kinase 4(Homo sapiens (Human))
Merck Sharp & Dohme
US Patent
LigandPNGBDBM384561(6-chloro-N-[trans-4- (morpholin-4- yl)cyclohexyl]q...)
Affinity DataIC50:  6nM. Assay description: The kinase activity of IRAK4 is determined by its ability to catalyze the phosphorylation of a fluorescent polypeptide substrate. The extent of phosp...
Ligand InfoPC cidPC sid
In DepthDetails US Patent