BDBM384615 US9932350, 3-45::tert-butyl 4-{trans-4-[(6- cyanoquinazolin-4- yl)amino]cyclohexyl} piperazine-1-carboxylate
SMILES CC(C)(C)OC(=O)N1CCN(CC1)[C@H]1CC[C@@H](CC1)Nc1ncnc2ccc(cc12)C#N
InChI Key InChIKey=DQADYIKKUBGQHE-WGSAOQKQSA-N
Data  1 IC50
  Tab Delimited (TSV)   2D SDfile   Computed 3D by Vconf -m prep SDfile
Find this compound or compounds like it in BindingDB:
Activity Spreadsheet -- Enzyme Inhibition Constant Data from BindingDB
Found 1 hit for monomerid = 384615
TargetInterleukin-1 receptor-associated kinase 4(Homo sapiens (Human))
Merck Sharp & Dohme
US Patent
LigandPNGBDBM384615(US9932350, 3-45 | tert-butyl 4-{trans-4-[(6- cyano...)
Affinity DataIC50:  6nM. Assay description: The kinase activity of IRAK4 is determined by its ability to catalyze the phosphorylation of a fluorescent polypeptide substrate. The extent of phosp...
Ligand InfoPC cidPC sid
In DepthDetails US Patent