BDBM384629 4-({Trans-4-[4-(cyclopropylcarbonyl)piperazin-1-yl]cyclohexyl}amino)quinazoline-6-carbonitrile ::US9932350, 6-1
SMILES O=C(C1CC1)N1CCN(CC1)[C@H]1CC[C@@H](CC1)Nc1ncnc2ccc(cc12)C#N
InChI Key InChIKey=VRCZQXYTUOQTPX-WGSAOQKQSA-N
Data  1 IC50
  Tab Delimited (TSV)   2D SDfile   Computed 3D by Vconf -m prep SDfile
Find this compound or compounds like it in BindingDB:
Activity Spreadsheet -- Enzyme Inhibition Constant Data from BindingDB
Found 1 hit for monomerid = 384629
TargetInterleukin-1 receptor-associated kinase 4(Homo sapiens (Human))
Merck Sharp & Dohme
US Patent
LigandPNGBDBM384629(4-({Trans-4-[4-(cyclopropylcarbonyl)piperazin-1-yl...)
Affinity DataIC50:  3nM. Assay description: The kinase activity of IRAK4 is determined by its ability to catalyze the phosphorylation of a fluorescent polypeptide substrate. The extent of phosp...
Ligand InfoPC cidPC sid
In DepthDetails US Patent