BDBM385797 US10287286, Example 200::oxolan-3-yl N-[5-(4-cyano-3- fluorophenyl)-[1,2,4]triazolo [1,5-a]pyridin-7-yl]carbamate
SMILES Fc1cc(ccc1C#N)-c1cc(NC(=O)OC2CCOC2)cc2ncnn12
InChI Key InChIKey=UXBPOYIPTITXBH-UHFFFAOYSA-N
Data  1 IC50
  Tab Delimited (TSV)   2D SDfile   Computed 3D by Vconf -m prep SDfile
Find this compound or compounds like it in BindingDB:
Activity Spreadsheet -- Enzyme Inhibition Constant Data from BindingDB
Found 1 hit for monomerid = 385797
TargetProlyl hydroxylase EGLN2(Homo sapiens (Human))
Takeda Pharmaceutical
US Patent
LigandPNGBDBM385797(US10287286, Example 200 | oxolan-3-yl N-[5-(4-cyan...)
Affinity DataIC50:  79nM. Assay description: The IC50 values for the PHD1 enzyme (residues 1-407) were determined by mixing increasing amounts of a compound of the invention with a fixed amount ...
Ligand InfoPC cidPC sid
In DepthDetails US Patent