BDBM386034 4-(4-(2-amino-1-(2-chlorophenyl)ethyl)piperazin-1-yl)-7,8-dihydropteridin-6(5H)-one::US10287300, Compound A39
SMILES NCC(N1CCN(CC1)c1ncnc2NCC(=O)Nc12)c1ccccc1Cl
InChI Key InChIKey=VKESACJPKOWOJO-UHFFFAOYSA-N
Data  2 IC50
  Tab Delimited (TSV)   2D SDfile   Computed 3D by Vconf -m prep SDfile
Find this compound or compounds like it in BindingDB:
Activity Spreadsheet -- Enzyme Inhibition Constant Data from BindingDB
Found 2 hits for monomerid = 386034
TargetProline-rich AKT1 substrate 1(Homo sapiens (Human))
Merck Patent
US Patent
LigandPNGBDBM386034(4-(4-(2-amino-1-(2-chlorophenyl)ethyl)piperazin-1-...)
Affinity DataIC50: >1.00E+3nM. Assay description: A TTP Mosquito liquid handling instrument was used to place 125 nl of the appropriate concentration of inhibitor in 100% DMSO (for a dose response cu...
Ligand InfoPC cidPC sid
In DepthDetails US Patent
TargetRibosomal protein S6 kinase beta-1 [T412E](Homo sapiens (Human))
Merck Patent
US Patent
LigandPNGBDBM386034(4-(4-(2-amino-1-(2-chlorophenyl)ethyl)piperazin-1-...)
Affinity DataIC50: >1.00E+3nM. Assay description: P70S6K inhibitor compounds were diluted and plated in 96 well plates. A reaction mixture including the following components was then added to the com...
Ligand InfoPC cidPC sid
In DepthDetails US Patent