BDBM387277 N-(2,6- Difluorophenyl)-5-(5- (5,5-dimethyl-4-oxo- 4,5-dihydroisoxazol- 3-yl)-2-methoxy- phenyl)thiophene- 2-carboxamide ::US10292981, Example 160
SMILES COc1ccc(cc1-c1ccc(s1)C(=O)Nc1c(F)cccc1F)C1=NOC(C)(C)C1=O
InChI Key InChIKey=ZAKLURTYMKCKHA-UHFFFAOYSA-N
Data  2 IC50
  Tab Delimited (TSV)   2D SDfile   Computed 3D by Vconf -m prep SDfile
Find this compound or compounds like it in BindingDB:
Activity Spreadsheet -- Enzyme Inhibition Constant Data from BindingDB
Found 2 hits for monomerid = 387277
TargetStore-operated calcium entry-associated regulatory factor(Homo sapiens (Human))
Lupin
US Patent
LigandPNGBDBM387277(N-(2,6- Difluorophenyl)-5-(5- (5,5-dimethyl-4-oxo-...)
Affinity DataIC50: <1.00E+3nM. Assay description: Jurkat E6.1 cells were seeded at a density of 1-2×105 cells per well in calcium-4 dye prepared in calcium free HBSS (Sigma, USA). Test compounds from...
Ligand InfoPC cidPC sid
In DepthDetails US Patent
TargetInterleukin-2(Homo sapiens (Human))
Lupin
US Patent
LigandPNGBDBM387277(N-(2,6- Difluorophenyl)-5-(5- (5,5-dimethyl-4-oxo-...)
Affinity DataIC50: <100nM. Assay description: Jurkat T cells were seeded at a density of 0.5 to 1 million cells per well in RPMI medium. Test compounds from this invention were added to the cells...
Ligand InfoPC cidPC sid
In DepthDetails US Patent