BDBM387452 N3-(3-Chloro-4- fluorophenyl)- 5-methoxy-7- methylfuro[2,3- c]pyridine-2,3- diamine::US10294212, No. 167::US10294212, No. 85
SMILES COc1cc2c(Nc3ccc(F)c(Cl)c3)c(N)oc2c(C)n1
InChI Key InChIKey=AXMSFVPTAZTCDK-UHFFFAOYSA-N
Data  2 IC50
  Tab Delimited (TSV)   2D SDfile   Computed 3D by Vconf -m prep SDfile
Find this compound or compounds like it in BindingDB:
Activity Spreadsheet -- Enzyme Inhibition Constant Data from BindingDB
Found 2 hits for monomerid = 387452
TargetIndoleamine 2,3-dioxygenase 1(Homo sapiens (Human))
Curadev Pharma
US Patent
LigandPNGBDBM387452(N3-(3-Chloro-4- fluorophenyl)- 5-methoxy-7- methyl...)
Affinity DataIC50: <200nM. Assay description: Human indoleamine 2,3-dioxygenasel (hIDO1) catalyzes the oxidative cleavage of the pyrrole ring of the indole nucleus of tryptophan to yield N-formyl...
Ligand InfoPC cidPC sid
In DepthDetails US Patent
TargetIndoleamine 2,3-dioxygenase 1(Homo sapiens (Human))
Curadev Pharma
US Patent
LigandPNGBDBM387452(N3-(3-Chloro-4- fluorophenyl)- 5-methoxy-7- methyl...)
Affinity DataIC50: <200nM. Assay description: Human indoleamine 2,3-dioxygenasel (hIDO1) catalyzes the oxidative cleavage of the pyrrole ring of the indole nucleus of tryptophan to yield N-formyl...
Ligand InfoPC cidPC sid
In DepthDetails US Patent