BDBM387644 4-(2-Amino-3- ((3- chlorophenyl) amino)furo[2,3- c]pyridin-7-yl)- N- methyl- picolinamide::US10294212, No. 225
SMILES CNC(=O)c1cc(ccn1)-c1nccc2c(Nc3cccc(Cl)c3)c(N)oc12
InChI Key InChIKey=LVMDULDUKIHLRO-UHFFFAOYSA-N
Data  1 IC50
  Tab Delimited (TSV)   2D SDfile   Computed 3D by Vconf -m prep SDfile
Find this compound or compounds like it in BindingDB:
Activity Spreadsheet -- Enzyme Inhibition Constant Data from BindingDB
Found 1 hit for monomerid = 387644
TargetIndoleamine 2,3-dioxygenase 1(Homo sapiens (Human))
Curadev Pharma
US Patent
LigandPNGBDBM387644(4-(2-Amino-3- ((3- chlorophenyl) amino)furo[2,3- c...)
Affinity DataIC50: <200nM. Assay description: Human indoleamine 2,3-dioxygenasel (hIDO1) catalyzes the oxidative cleavage of the pyrrole ring of the indole nucleus of tryptophan to yield N-formyl...
Ligand InfoPC cidPC sid
In DepthDetails US Patent