BDBM39032 4-(5-ethyl-1,3-benzoxazol-2-yl)aniline::MLS000060991::SMR000069756::[4-(5-ethyl-1,3-benzoxazol-2-yl)phenyl]amine::cid_735943
SMILES CCc1ccc2oc(nc2c1)-c1ccc(N)cc1
InChI Key InChIKey=ODZPTRODOSVYCM-UHFFFAOYSA-N
Data  3 IC50  1 EC50
  Tab Delimited (TSV)   2D SDfile   Computed 3D by Vconf -m prep SDfile
Find this compound or compounds like it in BindingDB:
Activity Spreadsheet -- Enzyme Inhibition Constant Data from BindingDB
Found 4 hits for monomerid = 39032
TargetSteroidogenic factor 1(Homo sapiens (Human))
The Scripps Research Institute Molecular Screening Center
Curated by PubChem BioAssay
LigandPNGBDBM39032(4-(5-ethyl-1,3-benzoxazol-2-yl)aniline | MLS000060...)
Affinity DataIC50: >3.67E+3nM. Assay description: Source (MLSCN Center Name): The Scripps Research Institute Molecular Screening Center Center Affiliation: The Scripps Research Institute, TSRI Assay ...
In DepthDetails PCBioAssay
TargetProtein skinhead-1(Caenorhabditis elegans)
Burnham Center For Chemical Genomics
Curated by PubChem BioAssay
LigandPNGBDBM39032(4-(5-ethyl-1,3-benzoxazol-2-yl)aniline | MLS000060...)
Affinity DataIC50:  8.78E+4nM
In DepthDetails PCBioAssay
TargetTranscription factor p65(Homo sapiens (Human))
Srmlsc
Curated by PubChem BioAssay
LigandPNGBDBM39032(4-(5-ethyl-1,3-benzoxazol-2-yl)aniline | MLS000060...)
Affinity DataEC50:  342nM. Assay description: Southern Research Molecular Libraries Screening Center (SRMLSC) Southern Research Institute (Birmingham, Alabama) NIH Molecular Libraries Screening C...
In DepthDetails PCBioAssay
TargetIsoform 2 of Nuclear receptor ROR-alpha (Alpha-2)(Homo sapiens (Human))
The Scripps Research Institute Molecular Screening Center
Curated by PubChem BioAssay
LigandPNGBDBM39032(4-(5-ethyl-1,3-benzoxazol-2-yl)aniline | MLS000060...)
Affinity DataIC50:  7.91E+3nM. Assay description: Source (MLSCN Center Name): The Scripps Research Institute Molecular Screening Center Center Affiliation: The Scripps Research Institute, TSRI Assay ...
In DepthDetails PCBioAssay