BDBM390750 US9957263, Example 12
SMILES CCS(=O)(=O)Nc1cc(c(Oc2ccc(F)cc2F)cc1C(=O)NC1CCOCC1)-c1cn(C)c(=O)c2[nH]ccc12
InChI Key InChIKey=ALSJLSKLYYATHY-UHFFFAOYSA-N
Data  2 KI
  Tab Delimited (TSV)   2D SDfile   Computed 3D by Vconf -m prep SDfile
Find this compound or compounds like it in BindingDB:
Activity Spreadsheet -- Enzyme Inhibition Constant Data from BindingDB
Found 2 hits for monomerid = 390750
TargetBromodomain-containing protein 4(Homo sapiens (Human))
Abbvie
US Patent
LigandPNGBDBM390750(US9957263, Example 12)
Affinity DataKi:  1.60nM. Assay description: Compound dilution series were prepared in DMSO via a 3-fold serial dilution from 2.5 mM to 42 nM. Compounds were then diluted 6:100 in assay buffer (...
Ligand InfoPC cidPC sid
In DepthDetails US Patent
TargetBromodomain-containing protein 4(Homo sapiens (Human))
Abbvie
US Patent
LigandPNGBDBM390750(US9957263, Example 12)
Affinity DataKi:  1.80nM. Assay description: Compound dilution series were prepared in DMSO via a 3-fold serial dilution from 2.5 mM to 42 nM. Compounds were then diluted 6:100 in assay buffer (...
Ligand InfoPC cidPC sid
In DepthDetails US Patent