BDBM390782 US9957263, Example 44
SMILES CC(=O)c1ccc(cc1)S(=O)(=O)Nc1cccc(Oc2ccc(cc2-c2cn(C)c(=O)c3[nH]ccc23)S(C)(=O)=O)c1
InChI Key InChIKey=KAMRMGPWSZBYKA-UHFFFAOYSA-N
Data  2 KI
  Tab Delimited (TSV)   2D SDfile   Computed 3D by Vconf -m prep SDfile
Find this compound or compounds like it in BindingDB:
Activity Spreadsheet -- Enzyme Inhibition Constant Data from BindingDB
Found 2 hits for monomerid = 390782
TargetBromodomain-containing protein 4(Homo sapiens (Human))
Abbvie
US Patent
LigandPNGBDBM390782(US9957263, Example 44)
Affinity DataKi:  2.10nM. Assay description: Compound dilution series were prepared in DMSO via a 3-fold serial dilution from 2.5 mM to 42 nM. Compounds were then diluted 6:100 in assay buffer (...
Ligand InfoPC cidPC sid
In DepthDetails US Patent
TargetBromodomain-containing protein 4(Homo sapiens (Human))
Abbvie
US Patent
LigandPNGBDBM390782(US9957263, Example 44)
Affinity DataKi:  4.90nM. Assay description: Compound dilution series were prepared in DMSO via a 3-fold serial dilution from 2.5 mM to 42 nM. Compounds were then diluted 6:100 in assay buffer (...
Ligand InfoPC cidPC sid
In DepthDetails US Patent