BDBM390806 US9957263, Example 69
SMILES Cn1cc(-c2cc(ccc2Oc2cccc(NCc3cccc(OC(F)(F)F)c3)c2)S(C)(=O)=O)c2cc[nH]c2c1=O
InChI Key InChIKey=AJSTYLMICVMDCO-UHFFFAOYSA-N
Data  2 KI
  Tab Delimited (TSV)   2D SDfile   Computed 3D by Vconf -m prep SDfile
Find this compound or compounds like it in BindingDB:
Activity Spreadsheet -- Enzyme Inhibition Constant Data from BindingDB
Found 2 hits for monomerid = 390806
TargetBromodomain-containing protein 4(Homo sapiens (Human))
Abbvie
US Patent
LigandPNGBDBM390806(US9957263, Example 69)
Affinity DataKi:  1.60nM. Assay description: Compound dilution series were prepared in DMSO via a 3-fold serial dilution from 2.5 mM to 42 nM. Compounds were then diluted 6:100 in assay buffer (...
Ligand InfoPC cidPC sid
In DepthDetails US Patent
TargetBromodomain-containing protein 4(Homo sapiens (Human))
Abbvie
US Patent
LigandPNGBDBM390806(US9957263, Example 69)
Affinity DataKi:  4.10nM. Assay description: Compound dilution series were prepared in DMSO via a 3-fold serial dilution from 2.5 mM to 42 nM. Compounds were then diluted 6:100 in assay buffer (...
Ligand InfoPC cidPC sid
In DepthDetails US Patent