BDBM390924 US9957263, Example 188
SMILES CN1CCN(Cc2cc3c(cn(C)c(=O)c3[nH]2)-c2cc(ccc2Oc2ccc(F)cc2F)S(C)(=O)=O)C(C1)c1ccccc1
InChI Key
Data  2 KI
  Tab Delimited (TSV)   2D SDfile   Computed 3D by Vconf -m prep SDfile
Find this compound or compounds like it in BindingDB:
Activity Spreadsheet -- Enzyme Inhibition Constant Data from BindingDB
Found 2 hits for monomerid = 390924
TargetBromodomain-containing protein 4(Homo sapiens (Human))
Abbvie
US Patent
LigandPNGBDBM390924(US9957263, Example 188)
Affinity DataKi:  1.56nM. Assay description: Compound dilution series were prepared in DMSO via a 3-fold serial dilution from 2.5 mM to 42 nM. Compounds were then diluted 6:100 in assay buffer (...
Ligand InfoPC cidPC sid
In DepthDetails US Patent
TargetBromodomain-containing protein 4(Homo sapiens (Human))
Abbvie
US Patent
LigandPNGBDBM390924(US9957263, Example 188)
Affinity DataKi:  151nM. Assay description: Compound dilution series were prepared in DMSO via a 3-fold serial dilution from 2.5 mM to 42 nM. Compounds were then diluted 6:100 in assay buffer (...
Ligand InfoPC cidPC sid
In DepthDetails US Patent