BDBM393478 (S)-1-(3,4- dihydro- pyrazino[1,2- a]indol- 2(1H)-yl)-2- (4- methyl-piperazin-1-yl)butan-1-one::US9963453, 46
SMILES CC[C@H](N1CCN(C)CC1)C(=O)N1CCn2c(C1)cc1ccccc21
InChI Key InChIKey=BGTMXHZTMRWJMS-SFHVURJKSA-N
Data  1 KI
  Tab Delimited (TSV)   2D SDfile   Computed 3D by Vconf -m prep SDfile
Find this compound or compounds like it in BindingDB:
Activity Spreadsheet -- Enzyme Inhibition Constant Data from BindingDB
Found 1 hit for monomerid = 393478
TargetSigma non-opioid intracellular receptor 1(Homo sapiens (Human))
Laboratorios Del Dr. Esteve
US Patent
LigandPNGBDBM393478((S)-1-(3,4- dihydro- pyrazino[1,2- a]indol- 2(1H)-...)
Affinity DataKi:  75.5nM. Assay description: To investigate binding properties of sigma 1 receptor ligands to human sigma 1 receptor, transfected HEK-293 membranes and [3H](+)-pentazocine (Perki...
Ligand InfoPC cidPC sid
In DepthDetails US Patent