BDBM393479 (R)-1-(3,4- dihydro- pyrazino[1,2- a]indol- 2(1H)-yl)-2- methyl-3-(4- methyl- piperazin-1- yl)propan-1-one::US9963453, 47
SMILES C[C@H](CN1CCN(C)CC1)C(=O)N1CCn2c(C1)cc1ccccc21
InChI Key InChIKey=QYTKPZLMGIOIDY-MRXNPFEDSA-N
Data  1 KI
  Tab Delimited (TSV)   2D SDfile   Computed 3D by Vconf -m prep SDfile
Find this compound or compounds like it in BindingDB:
Activity Spreadsheet -- Enzyme Inhibition Constant Data from BindingDB
Found 1 hit for monomerid = 393479
TargetSigma non-opioid intracellular receptor 1(Homo sapiens (Human))
Laboratorios Del Dr. Esteve
US Patent
LigandPNGBDBM393479((R)-1-(3,4- dihydro- pyrazino[1,2- a]indol- 2(1H)-...)
Affinity DataKi:  49.5nM. Assay description: To investigate binding properties of sigma 1 receptor ligands to human sigma 1 receptor, transfected HEK-293 membranes and [3H](+)-pentazocine (Perki...
Ligand InfoPC cidPC sid
In DepthDetails US Patent