BDBM393484 (S)-2-(4- cyclohexyl- piperazin-1- yl)-1-((R)- 3,4,10,10a- tetrahydro- pyrazino[1,2- a]indol-2(1H)-yl)propan-1-one::US9963453, 52
SMILES C[C@H](N1CCN(CC1)C1CCCCC1)C(=O)N1CCN2[C@H](Cc3ccccc23)C1
InChI Key InChIKey=TWYIDXSNAUPORF-SIKLNZKXSA-N
Data  1 KI
  Tab Delimited (TSV)   2D SDfile   Computed 3D by Vconf -m prep SDfile
Find this compound or compounds like it in BindingDB:
Activity Spreadsheet -- Enzyme Inhibition Constant Data from BindingDB
Found 1 hit for monomerid = 393484
TargetSigma non-opioid intracellular receptor 1(Homo sapiens (Human))
Laboratorios Del Dr. Esteve
US Patent
LigandPNGBDBM393484((S)-2-(4- cyclohexyl- piperazin-1- yl)-1-((R)- 3,4...)
Affinity DataKi:  142nM. Assay description: To investigate binding properties of sigma 1 receptor ligands to human sigma 1 receptor, transfected HEK-293 membranes and [3H](+)-pentazocine (Perki...
Ligand InfoPC cidPC sid
In DepthDetails US Patent