BDBM395798 US10308654, Example 26
SMILES CCN1CCN(CC1)c1ccc(Nc2ncc3cc(C(=O)N(C)C)n(N4CCCCC4)c3n2)nc1
InChI Key InChIKey=VRLLCDPXZPTHGO-UHFFFAOYSA-N
Data  2 IC50
  Tab Delimited (TSV)   2D SDfile   Computed 3D by Vconf -m prep SDfile
Find this compound or compounds like it in BindingDB:
Activity Spreadsheet -- Enzyme Inhibition Constant Data from BindingDB
Found 2 hits for monomerid = 395798
TargetCyclin-dependent kinase/G2/mitotic-specific cyclin- 1(Homo sapiens (Human))
Changzhou Longthera Pharmaceuticals
US Patent
LigandPNGBDBM395798(US10308654, Example 26)
Affinity DataIC50:  550nM. Assay description: The test compound was dissolved in dimethyl sulfoxide and the solution was diluted to each concentration gradient with a buffer (50 mM HEPES, 10 mM M...
Ligand InfoPC cidPC sid
In DepthDetails US Patent
TargetCyclin-dependent kinase 4/G1/S-specific cyclin-D1(Homo sapiens (Human))
Changzhou Longthera Pharmaceuticals
US Patent
LigandPNGBDBM395798(US10308654, Example 26)
Affinity DataIC50: <10nM. Assay description: The test compound was dissolved in dimethyl sulfoxide and the solution was diluted to each concentration gradient with a buffer (50 mM HEPES, 10 mM M...
Ligand InfoPC cidPC sid
In DepthDetails US Patent