BDBM40374 1-(3-amino-4,6-dimethyl-2-pyrazolo[3,4-b]pyridinyl)ethanone::1-(3-amino-4,6-dimethyl-pyrazolo[3,4-b]pyridin-2-yl)ethanone::1-(3-amino-4,6-dimethylpyrazolo[3,4-b]pyridin-2-yl)ethanone::1-(3-azanyl-4,6-dimethyl-pyrazolo[3,4-b]pyridin-2-yl)ethanone::2-acetyl-4,6-dimethyl-2H-pyrazolo[3,4-b]pyridin-3-amine::MLS000045822::SMR000028219::cid_3245414
SMILES CC(=O)n1nc2nc(C)cc(C)c2c1N
InChI Key InChIKey=QUCBBNOPVFRPAV-UHFFFAOYSA-N
Data  2 IC50  1 EC50
  Tab Delimited (TSV)   2D SDfile   Computed 3D by Vconf -m prep SDfile
Find this compound or compounds like it in BindingDB:
Activity Spreadsheet -- Enzyme Inhibition Constant Data from BindingDB
Found 3 hits for monomerid = 40374
TargetCoagulation factor XII(Homo sapiens (Human))
Pcmd
Curated by PubChem BioAssay
LigandPNGBDBM40374(1-(3-amino-4,6-dimethyl-2-pyrazolo[3,4-b]pyridinyl...)
Affinity DataIC50:  4.81E+3nM. Assay description: Molecular Library Screening Center Network (MLSCN) Penn Center for Molecular Discovery (PCMD) Assay Provider: Scott L. Diamond, University of Pennsy...
Ligand InfoPC cidPC sid
In DepthDetails PCBioAssay
TargetBcl-2-like protein 11(Homo sapiens (Human))
Broad Institute
Curated by PubChem BioAssay
LigandPNGBDBM40374(1-(3-amino-4,6-dimethyl-2-pyrazolo[3,4-b]pyridinyl...)
Affinity DataEC50: >3.50E+5nM. Assay description: Keywords: apoptosis, BH3 domain, Bcl2-A1, BIM, caspase, cancer Primary Collaborator: Todd Golub, Broad Institute, golub@broadinstitute.org Assay Over...
Ligand InfoPC cidPC sid
In DepthDetails PCBioAssay
TargetCoagulation factor XII(Homo sapiens (Human))
Pcmd
Curated by PubChem BioAssay
LigandPNGBDBM40374(1-(3-amino-4,6-dimethyl-2-pyrazolo[3,4-b]pyridinyl...)
Affinity DataIC50:  4.81E+3nM. Assay description: Molecular Library Screening Center Network (MLSCN) Penn Center for Molecular Discovery (PCMD) Assay Provider: Scott L. Diamond, University of Pennsy...
Ligand InfoPC cidPC sid
In DepthDetails PCBioAssay