BDBM404313 1-(2-{[(2R,5R)-2-Methyl-5-{3-[(1R)- 2,2,2-Trifluoro-1-hydroxyethyl]isoxazol- 5-yl}piperidin-1- yl]carbonyl}phenyl) cyclopropanecarbonitrile::US10017504, 44
SMILES C[C@@H]1CC[C@H](CN1C(=O)c1ccccc1C1(CC1)C#N)c1cc(no1)[C@@H](O)C(F)(F)F
InChI Key InChIKey=CFVAZBPUVLVBJL-PJIJBLCYSA-N
Data  2 IC50
  Tab Delimited (TSV)   2D SDfile   Computed 3D by Vconf -m prep SDfile
Find this compound or compounds like it in BindingDB:
Activity Spreadsheet -- Enzyme Inhibition Constant Data from BindingDB
Found 2 hits for monomerid = 404313
TargetOrexin/Hypocretin receptor type 1(Homo sapiens (Human))
Merck Sharp & Dohme
US Patent
LigandPNGBDBM404313(1-(2-{[(2R,5R)-2-Methyl-5-{3-[(1R)- 2,2,2-Trifluor...)
Affinity DataIC50:  2.18E+3nM. Assay description: n a typical experiment the OX1 and OX2 receptor antagonistic activity of the compounds of the present invention was determined in accordance with the...
Ligand InfoPC cidPC sid
In DepthDetails US Patent
TargetOrexin receptor type 2(Homo sapiens (Human))
Merck Sharp & Dohme
US Patent
LigandPNGBDBM404313(1-(2-{[(2R,5R)-2-Methyl-5-{3-[(1R)- 2,2,2-Trifluor...)
Affinity DataIC50:  26.8nM. Assay description: n a typical experiment the OX1 and OX2 receptor antagonistic activity of the compounds of the present invention was determined in accordance with the...
Ligand InfoPC cidPC sid
In DepthDetails US Patent